Target
Aurora kinase B
Ligand
BDBM50044675
Substrate
Meas. Tech.
ChEMBL_1450872 (CHEMBL3364631)
IC50
49±n/a nM
Citation
 Sampson, PBLiu, YPatel, NKFeher, MForrest, BLi, SWEdwards, LLaufer, RLang, YBan, FAwrey, DEMao, GPlotnikova, OLeung, GHodgson, RMason, JMWei, XKiarash, RGreen, EQiu, WChirgadze, NYMak, TWPan, GPauls, HW The discovery of Polo-like kinase 4 inhibitors: design and optimization of spiro[cyclopropane-1,3'[3H]indol]-2'(1'H).ones as orally bioavailable antitumor agents. J Med Chem 58:130-46 (2015)  
Target
Name:
Aurora kinase B
Synonyms:
AIK2 AIM1 ARK2 AURKB_HUMAN Aurora B-INCENP Aurora kinase B (AURKB) STK-1 STK12 Serine/threonine-protein kinase aurora B
Type:
Protein
Mol. Mass.:
39327.72
Organism:
Homo sapiens (Human)
Description:
Q96GD4
Residue:
344
  
Inhibitor
Name:
BDBM50044675
Synonyms:
CHEMBL3353354 US9907800, Example A56
Type:
Small organic molecule
Emp. Form.:
C30H28N4O2
Mol. Mass.:
476.5689
SMILES:
O=C1Nc2ccccc2[C@]11C[C@H]1c1ccc2c(\C=C\c3ccc(CN4CCOCC4)cc3)n[nH]c2c1
: