Target
NPC1-like intracellular cholesterol transporter 1
Ligand
BDBM50045532
Substrate
Meas. Tech.
ChEMBL_1451836 (CHEMBL3362445)
EC50
560±n/a nM
Citation
 Ohgane, KKaraki, FNoguchi-Yachide, TDodo, KHashimoto, Y Structure-activity relationships of oxysterol-derived pharmacological chaperones for Niemann-Pick type C1 protein. Bioorg Med Chem Lett 24:3480-5 (2014)  
Target
Name:
NPC1-like intracellular cholesterol transporter 1
Synonyms:
NPC1L1 Niemann-Pick C1-like protein 1
Type:
PROTEIN
Mol. Mass.:
148724.10
Organism:
Homo sapiens (Human)
Description:
ChEMBL_1451836
Residue:
1359
  
Inhibitor
Name:
BDBM50045532
Synonyms:
CHEMBL3311379
Type:
Small organic molecule
Emp. Form.:
C33H59NO6
Mol. Mass.:
565.8247
SMILES:
[H][C@@]1(CC[C@@]2([H])[C@]3([H])C[C@@H](O)[C@@]4(O)C[C@H](CC[C@]4(C)[C@@]3([H])CC[C@]12C)OCC(=O)N(CCO)CCO)[C@H](C)CCCC(C)C
: