Target
Tyrosine-protein kinase receptor UFO
Ligand
BDBM50055490
Substrate
Meas. Tech.
ChEMBL_1451337 (CHEMBL3363356)
IC50
15±n/a nM
Citation
 Zhang, WDeRyckere, DHunter, DLiu, JStashko, MAMinson, KACummings, CTLee, MGlaros, TGNewton, DLSather, SZhang, DKireev, DJanzen, WPEarp, HSGraham, DKFrye, SVWang, X UNC2025, a potent and orally bioavailable MER/FLT3 dual inhibitor. J Med Chem 57:7031-41 (2014)  
Target
Name:
Tyrosine-protein kinase receptor UFO
Synonyms:
AXL TEL/AXL UFO | UFO_HUMAN
Type:
Enzyme
Mol. Mass.:
98316.97
Organism:
Homo sapiens (Human)
Description:
P30530
Residue:
894
  
Inhibitor
Name:
BDBM50055490
Synonyms:
CHEMBL3326007
Type:
Small organic molecule
Emp. Form.:
C29H40N6O
Mol. Mass.:
488.6675
SMILES:
CN1CCN(Cc2ccc(cc2)-c2cn([C@H]3CC[C@H](O)CC3)c3nc(NCCC4CC4)ncc23)CC1
: