Target
5-hydroxytryptamine receptor 7
Ligand
BDBM50058211
Substrate
Meas. Tech.
ChEMBL_1453267 (CHEMBL3365905)
Ki
26±n/a nM
Citation
 Kim, YTae, JLee, KRhim, HChoo, IHCho, HPark, WKKeum, GChoo, H Novel N-biphenyl-2-ylmethyl 2-methoxyphenylpiperazinylalkanamides as 5-HT7R antagonists for the treatment of depression. Bioorg Med Chem 22:4587-96 (2014)  
Target
Name:
5-hydroxytryptamine receptor 7
Synonyms:
5-HT-7 5-HT7 5-HT7S 5HT7 HTR7 | Serotonin receptor 7
Type:
G Protein-Coupled Receptor (GPCR)
Mol. Mass.:
53573.08
Organism:
Homo sapiens (Human)
Description:
P34969
Residue:
479
  
Inhibitor
Name:
BDBM50058211
Synonyms:
CHEMBL3326984
Type:
Small organic molecule
Emp. Form.:
C29H34ClN3O2
Mol. Mass.:
492.052
SMILES:
COc1ccccc1N1CCN(CCCCC(=O)NCc2ccccc2-c2ccc(Cl)cc2)CC1
: