Target
Translocator protein
Ligand
BDBM50073589
Substrate
Meas. Tech.
ChEMBL_1467416 (CHEMBL3411700)
Ki
2.2±n/a nM
Citation
 Banister, SDBeinat, CWilkinson, SMShen, BBartoli, CSelleri, SDa Pozzo, EMartini, CChin, FTKassiou, M Ether analogues of DPA-714 with subnanomolar affinity for the translocator protein (TSPO). Eur J Med Chem 93:392-400 (2015)  
Target
Name:
Translocator protein
Synonyms:
Benzodiazepine receptors; peripheral & central Mbr PBR Peripheral benzodiazepine receptor (PBR) TSPO_RAT | Tspo
Type:
Mitochondrion membrane protein
Mol. Mass.:
18945.84
Organism:
Rattus norvegicus (rat)
Description:
Competitive binding experiments were performed on rat kidney mitochondrial membranes.
Residue:
169
  
Inhibitor
Name:
BDBM50073589
Synonyms:
CHEMBL3408958
Type:
Small organic molecule
Emp. Form.:
C23H30N4O2
Mol. Mass.:
394.5099
SMILES:
CCN(CC)C(=O)Cc1c(nn2c(C)cc(C)nc12)-c1ccc(OC(C)C)cc1
: