Target
Endoplasmic reticulum aminopeptidase 2
Ligand
BDBM50077020
Substrate
Meas. Tech.
ChEMBL_1473169 (CHEMBL3418221)
IC50
1400±n/a nM
Citation
 Papakyriakou, AZervoudi, ETsoukalidou, SMauvais, FXSfyroera, GMastellos, DCvan Endert, PTheodorakis, EAVourloumis, DStratikos, E 3,4-diaminobenzoic acid derivatives as inhibitors of the oxytocinase subfamily of M1 aminopeptidases with immune-regulating properties. J Med Chem 58:1524-43 (2015)  
Target
Name:
Endoplasmic reticulum aminopeptidase 2
Synonyms:
Aminopeptidase ERAP2_HUMAN | LRAP
Type:
PROTEIN
Mol. Mass.:
110463.90
Organism:
Homo sapiens (Human)
Description:
ChEMBL_1473169
Residue:
960
  
Inhibitor
Name:
BDBM50077020
Synonyms:
CHEMBL3416729
Type:
Small organic molecule
Emp. Form.:
C23H31N7O5
Mol. Mass.:
485.5361
SMILES:
COC(=O)[C@H](Cc1ccc(O)cc1)NC(=O)c1ccc(NC(=O)[C@@H](N)CCCNC(N)=N)c(N)c1
: