Target
Mitogen-activated protein kinase 3
Ligand
BDBM50088856
Substrate
Meas. Tech.
ChEMBL_1497089 (CHEMBL3580222)
IC50
57±n/a nM
Citation
 Awadallah, FMAbou-Seri, SMAbdulla, MMGeorgey, HH Design and synthesis of potent 1,2,4-trisubstituted imidazolinone derivatives with dual p38aMAPK and ERK1/2 inhibitory activity. Eur J Med Chem 94:397-404 (2015)  
Target
Name:
Mitogen-activated protein kinase 3
Synonyms:
ERK1 Extracellular signal-regulated kinase 1 MAP kinase ERK1 MAPK3/MAPK7 Mitogen-activated protein kinase PRKM3
Type:
Protein
Mol. Mass.:
43136.58
Organism:
Homo sapiens (Human)
Description:
curated by PDB 4QTB
Residue:
379
  
Inhibitor
Name:
BDBM50088856
Synonyms:
CHEMBL3577631
Type:
Small organic molecule
Emp. Form.:
C32H27N3O5
Mol. Mass.:
533.5739
SMILES:
COc1cccc(NC(=O)COc2ccc(\C=C3/N=C(N(C3=O)c3cccc(OC)c3)c3ccccc3)cc2)c1
: