Target
Cytochrome P450 11B2, mitochondrial
Ligand
BDBM50092185
Substrate
Meas. Tech.
ChEMBL_1498857 (CHEMBL3583831)
IC50
0.400000±n/a nM
Target
Name:
Cytochrome P450 11B2, mitochondrial
Synonyms:
Aldosterone Synthase (CYP11B2) Aldosterone-synthesizing enzyme CYP11B2 Cytochrome P450 11B2 Cytochrome P450 11B2, mitochondrial P-450C18 | Steroid 18-hydroxylase
Type:
Protein
Mol. Mass.:
57582.15
Organism:
Homo sapiens (Human)
Description:
P19099
Residue:
503
  
Inhibitor
Name:
BDBM50092185
Synonyms:
CHEMBL3582474
Type:
Small organic molecule
Emp. Form.:
C16H13F2N3O
Mol. Mass.:
301.2907
SMILES:
COc1cncc(c1)-c1nc2cc(F)c(F)cc2n1C1CC1
: