Target
Orexin receptor type 2
Ligand
BDBM50093815
Substrate
Meas. Tech.
ChEMBL_1502023 (CHEMBL3588582)
Ki
2.0±n/a nM
Citation
 Yoshida, YNaoe, YTerauchi, TOzaki, FDoko, TTakemura, ATanaka, TSorimachi, KBeuckmann, CTSuzuki, MUeno, TOzaki, SYonaga, M Discovery of (1R,2S)-2-{[(2,4-Dimethylpyrimidin-5-yl)oxy]methyl}-2-(3-fluorophenyl)-N-(5-fluoropyridin-2-yl)cyclopropanecarboxamide (E2006): A Potent and Efficacious Oral Orexin Receptor Antagonist. J Med Chem 58:4648-64 (2015)  
Target
Name:
Orexin receptor type 2
Synonyms:
HCRTR2 OX2R_HUMAN Orexin receptor type 2 (OR-2) Orexin receptor type 2 (OX2R) Ox-2-R | Ox2-R
Type:
Protein
Mol. Mass.:
50710.53
Organism:
Homo sapiens (Human)
Description:
O43614
Residue:
444
  
Inhibitor
Name:
BDBM50093815
Synonyms:
CHEMBL3585948
Type:
Small organic molecule
Emp. Form.:
C22H21ClN4O2
Mol. Mass.:
408.881
SMILES:
Cc1ncc(OC[C@]2(C[C@H]2C(=O)Nc2ccc(Cl)cn2)c2ccccc2)c(C)n1
: