Target
Similar to alpha-tubulin isoform 1/Tubulin beta-2B chain
Ligand
BDBM50014846
Substrate
Meas. Tech.
ChEMBL_1503326 (CHEMBL3590717)
IC50
2620±n/a nM
Citation
 Wang, YTQin, YJYang, NZhang, YLLiu, CHZhu, HL Synthesis, biological evaluation, and molecular docking studies of novel 1-benzene acyl-2-(1-methylindol-3-yl)-benzimidazole derivatives as potential tubulin polymerization inhibitors. Eur J Med Chem 99:125-37 (2015)  
Target
Name:
Similar to alpha-tubulin isoform 1/Tubulin beta-2B chain
Synonyms:
Tubulin | Tubulin alpha chain /beta chain
Type:
Mol. Mass.:
Description:
ASSAY_ID of EBI is 51441
Components:
This complex has 2 components.
Component 1
Name:
Tubulin beta-2B chain
Synonyms:
TBB2B_BOVIN Tubulin | Tubulin beta chain
Type:
PROTEIN
Mol. Mass.:
49932.38
Organism:
Bos taurus
Description:
ChEMBL_211651
Residue:
445
  
Component 2
Name:
Similar to alpha-tubulin isoform 1
Synonyms:
Tubulin
Type:
PROTEIN
Mol. Mass.:
9422.48
Organism:
Bos taurus
Description:
EBI_18002
Residue:
84
  
Inhibitor
Name:
BDBM50014846
Synonyms:
(S)-N-(5,6,7,9-tetrahydro-1,2,3,10-tetramethoxy-9-oxobenzo[a]heptalen-7-yl)acetamide 7alphaH-colchicine COLCHICINE colchicina | colchicinum
Type:
Small organic molecule
Emp. Form.:
C22H25NO6
Mol. Mass.:
399.437
SMILES:
COc1cc2CC[C@H](NC(C)=O)c3cc(=O)c(OC)ccc3-c2c(OC)c1OC
: