Target
Sodium-dependent noradrenaline transporter
Ligand
BDBM50098899
Substrate
Meas. Tech.
ChEMBL_1456969 (CHEMBL3368420)
IC50
426±n/a nM
Citation
 Zheng, YYWeng, ZJXie, PZhu, MYXing, LXLi, JQ Synthesis and pharmacological investigation of aralkyl diamine derivatives as potential triple reuptake inhibitors. Eur J Med Chem 86:219-34 (2014)  
Target
Name:
Sodium-dependent noradrenaline transporter
Synonyms:
Monoamine transporter NET Noradrenaline Transporter (NET) Norepinephrine transporter protein (NET) SLC6A2 Sodium-dependent noradrenaline transporter (NET) | Solute carrier family 6 member 2
Type:
Multi-pass membrane protein
Mol. Mass.:
69337.72
Organism:
Homo sapiens (Human)
Description:
P23975
Residue:
617
  
Inhibitor
Name:
BDBM50098899
Synonyms:
CHEMBL3334773
Type:
Small organic molecule
Emp. Form.:
C25H30Cl2N2
Mol. Mass.:
429.425
SMILES:
Clc1ccc(cc1Cl)C(CCN1CCC(Cc2ccccc2)=CC1)N1CCCC1
: