Target
Cytochrome P450 1A2
Ligand
BDBM50113266
Substrate
Meas. Tech.
ChEMBL_1508787 (CHEMBL3603196)
Ki
1720±n/a nM
Citation
 Liu, JPham, PTSkripnikova, EVZheng, SLovings, LJWang, YGoyal, NBellow, SMMensah, LMChatters, AJBratton, MRWiese, TEZhao, MWang, GForoozesh, M A Ligand-Based Drug Design. Discovery of 4-Trifluoromethyl-7,8-pyranocoumarin as a Selective Inhibitor of Human Cytochrome P450 1A2. J Med Chem 58:6481-93 (2015)  
Target
Name:
Cytochrome P450 1A2
Synonyms:
CP1A2_HUMAN CYPIA2 Cytochrome P(3)450 Cytochrome P450 1A2 (CYP1A2) Cytochrome P450-P3
Type:
Enzyme
Mol. Mass.:
58423.38
Organism:
Homo sapiens (Human)
Description:
P05177
Residue:
516
  
Inhibitor
Name:
BDBM50113266
Synonyms:
CHEMBL3601438
Type:
Small organic molecule
Emp. Form.:
C19H14O3
Mol. Mass.:
290.3127
SMILES:
Cc1c(-c2ccccc2)c2ccc3OCC=Cc3c2oc1=O
: