Target
Cytochrome P450 1B1
Ligand
BDBM50113268
Substrate
Meas. Tech.
ChEMBL_1508788 (CHEMBL3603197)
Ki
20400±n/a nM
Citation
 Liu, JPham, PTSkripnikova, EVZheng, SLovings, LJWang, YGoyal, NBellow, SMMensah, LMChatters, AJBratton, MRWiese, TEZhao, MWang, GForoozesh, M A Ligand-Based Drug Design. Discovery of 4-Trifluoromethyl-7,8-pyranocoumarin as a Selective Inhibitor of Human Cytochrome P450 1A2. J Med Chem 58:6481-93 (2015)  
Target
Name:
Cytochrome P450 1B1
Synonyms:
CP1B1_HUMAN CYPIB1 | Cytochrome P450 1B1 (CYP1B1)
Type:
PROTEIN
Mol. Mass.:
60861.81
Organism:
Homo sapiens (Human)
Description:
ChEMBL_1474523
Residue:
543
  
Inhibitor
Name:
BDBM50113268
Synonyms:
CHEMBL3601440
Type:
Small organic molecule
Emp. Form.:
C13H7F3O3
Mol. Mass.:
268.1881
SMILES:
FC(F)(F)c1cc(=O)oc2c3C=CCOc3ccc12
: