Target
Metabotropic glutamate receptor 4
Ligand
BDBM50116515
Substrate
Meas. Tech.
ChEMBL_1512614 (CHEMBL3610661)
EC50
9.0±n/a nM
Citation
 Zhang, ZKil, KEPoutiainen, PChoi, JKKang, HJHuang, XPRoth, BLBrownell, AL Re-exploring the N-phenylpicolinamide derivatives to develop mGlu4 ligands with improved affinity and in vitro microsomal stability. Bioorg Med Chem Lett 25:3956-60 (2015)  
Target
Name:
Metabotropic glutamate receptor 4
Synonyms:
GRM4_RAT Grm4 Metabotropic glutamate receptor 4 (mGlu4) mGlu4 metabotropic glutamate 4a
Type:
Enzyme
Mol. Mass.:
101849.79
Organism:
Rattus norvegicus (Rat)
Description:
P31423
Residue:
912
  
Inhibitor
Name:
BDBM50116515
Synonyms:
CHEMBL3609729
Type:
Small organic molecule
Emp. Form.:
C12H12N6S
Mol. Mass.:
272.329
SMILES:
Cc1sc(Nc2nccc(C)n2)nc1-c1cn[nH]c1
: