Target
Aurora kinase A
Ligand
BDBM50123581
Substrate
Meas. Tech.
ChEMBL_1521798 (CHEMBL3626658)
IC50
800±n/a nM
Citation
 Thoma, GVeenstra, SStrang, RBlanz, JVangrevelinghe, EBerghausen, JLee, CCZerwes, HG Orally bioavailable Syk inhibitors with activity in a rat PK/PD model. Bioorg Med Chem Lett 25:4642-7 (2015)  
Target
Name:
Aurora kinase A
Synonyms:
AIK ARK1 AURKA AYK1 Aurora kinase A (AURA) Aurora kinase A (Aurora A) Aurora-related kinase 1 BTAK Breast-tumor-amplified kinase STK15 Serine/threonine kinase 15 Serine/threonine-protein kinase aurora A hARK1
Type:
Serine/threonine-protein kinase
Mol. Mass.:
45830.98
Organism:
Homo sapiens (Human)
Description:
O14965
Residue:
403
  
Inhibitor
Name:
BDBM50123581
Synonyms:
CHEMBL3622207
Type:
Small organic molecule
Emp. Form.:
C16H17N5O2S
Mol. Mass.:
343.403
SMILES:
[H][C@@]1(CNC(=O)C1)[C@@H](C)Oc1nc(cc2nscc12)-c1cnn(C)c1
: