Target
Kappa-type opioid receptor
Ligand
BDBM50027433
Substrate
Meas. Tech.
ChEMBL_1525032 (CHEMBL3637630)
Ki
0.360000±n/a nM
Citation
 Molenveld, PBouzanne des Mazery, RSterk, GJStorcken, RPAutar, Rvan Oss, Bvan der Haas, RNFröhlich, RSchepmann, DWünsch, BSoeberdt, M Conformationally restricted¿-opioid receptor agonists: Synthesis and pharmacological evaluation of diastereoisomeric and enantiomeric decahydroquinoxalines. Bioorg Med Chem Lett 25:5326-30 (2015)  
Target
Name:
Kappa-type opioid receptor
Synonyms:
Kappa Opioid Receptor OPRK1 Opiate Kappa 1 | mu/kappa opioid receptor
Type:
G Protein-Coupled Receptor (GPCR)
Mol. Mass.:
42744.99
Organism:
Cavia porcellus (domestic guinea pig)
Description:
P41144
Residue:
380
  
Inhibitor
Name:
BDBM50027433
Synonyms:
CHEMBL603370 | GR-89696
Type:
Small organic molecule
Emp. Form.:
C19H25Cl2N3O3
Mol. Mass.:
414.326
SMILES:
COC(=O)N1CCN(C(CN2CCCC2)C1)C(=O)Cc1ccc(Cl)c(Cl)c1
: