Target
Translocator protein
Ligand
BDBM50131400
Substrate
Meas. Tech.
ChEMBL_1526857 (CHEMBL3636925)
Ki
806±n/a nM
Citation
 Narlawar, RWerry, ELScarf, AMHanani, RChua, SWKing, VABarron, MLMartins, RNIttner, LMRendina, LMKassiou, M First Demonstration of Positive Allosteric-like Modulation at the Human Wild Type Translocator Protein (TSPO). J Med Chem 58:8743-9 (2015)  
Target
Name:
Translocator protein
Synonyms:
BZRP Mitochondrial benzodiazepine receptor PKBS Peripheral-type benzodiazepine receptor TSPO_HUMAN
Type:
Enzyme
Mol. Mass.:
18834.74
Organism:
Homo sapiens (Human)
Description:
P30536
Residue:
169
  
Inhibitor
Name:
BDBM50131400
Synonyms:
CHEMBL3634876
Type:
Small organic molecule
Emp. Form.:
C23H28N2O2
Mol. Mass.:
364.4806
SMILES:
CCN(CC)C(=O)Cn1c(cc2c(C)cc(C)cc12)-c1ccc(OC)cc1
: