Target
Palmitoleoyl-protein carboxylesterase NOTUM
Ligand
BDBM50144578
Substrate
Meas. Tech.
ChEMBL_1551505 (CHEMBL3762926)
EC50
13±n/a nM
Citation
 Han, QPabba, PKBarbosa, JMabon, RHealy, JPGardyan, MWTerranova, KMBrommage, RThompson, AYSchmidt, JMWilson, AGXu, XTarver, JECarson, KG 4H-Thieno[3,2-c]chromene based inhibitors of Notum Pectinacetylesterase. Bioorg Med Chem Lett 26:1184-7 (2016)  
Target
Name:
Palmitoleoyl-protein carboxylesterase NOTUM
Synonyms:
NOTUM_MOUSE Palmitoleoyl-protein carboxylesterase NOTUM
Type:
PROTEIN
Mol. Mass.:
56587.82
Organism:
Mus musculus
Description:
ChEMBL_116720
Residue:
503
  
Inhibitor
Name:
BDBM50144578
Synonyms:
CHEMBL3760062
Type:
Small organic molecule
Emp. Form.:
C13H8ClFO2S
Mol. Mass.:
282.718
SMILES:
OC(=O)c1cc2CCc3c(Cl)cc(F)cc3-c2s1
: