Target
Poly [ADP-ribose] polymerase 1
Ligand
BDBM50446130
Substrate
Meas. Tech.
ChEMBL_1553356 (CHEMBL3767926)
EC50
4.7±n/a nM
Citation
 Wang, BChu, DFeng, YShen, YAoyagi-Scharber, MPost, LE Discovery and Characterization of (8S,9R)-5-Fluoro-8-(4-fluorophenyl)-9-(1-methyl-1H-1,2,4-triazol-5-yl)-2,7,8,9-tetrahydro-3H-pyrido[4,3,2-de]phthalazin-3-one (BMN 673, Talazoparib), a Novel, Highly Potent, and Orally Efficacious Poly(ADP-ribose) Polymerase-1/2 Inhibitor, as an Anticancer Agent. J Med Chem 59:335-57 (2016)  
Target
Name:
Poly [ADP-ribose] polymerase 1
Synonyms:
(ARTD1 or PARP1) 2.4.2.30 ADPRT ARTD1 Human diphtheria toxin-like ADP-ribosyltransferase (ARTD1 or PARP1) NT-PARP-1 PARP1 PPOL Poly [ADP-ribose] polymerase 1 (PARP) Poly [ADP-ribose] polymerase 1 (PARP1) Poly [ADP-ribose] polymerase 1, 28-kDa form Poly [ADP-ribose] polymerase 1, processed C-terminus Poly [ADP-ribose] polymerase-1 Poly(ADP-ribose) polymerase-1 (ARTD1/PARP1) Protein poly-ADP-ribosyltransferase PARP1 | Synonyms=ADPRT
Type:
Mol. Mass.:
113114.22
Organism:
Homo sapiens (Human)
Description:
P09874
Residue:
1014
  
Inhibitor
Name:
BDBM50446130
Synonyms:
AG-014699 RUCAPARIB CAMSYLATE | Rucaparib
Type:
Small organic molecule
Emp. Form.:
C19H18FN3O
Mol. Mass.:
323.3641
SMILES:
CNCc1ccc(cc1)-c1[nH]c2cc(F)cc3C(=O)NCCc1c23
: