Target
Histone deacetylase 6
Ligand
BDBM50148616
Substrate
Meas. Tech.
ChEMBL_1556878 (CHEMBL3771760)
IC50
2180±n/a nM
Citation
 Senger, JMelesina, JMarek, MRomier, COehme, IWitt, OSippl, WJung, M Synthesis and Biological Investigation of Oxazole Hydroxamates as Highly Selective Histone Deacetylase 6 (HDAC6) Inhibitors. J Med Chem 59:1545-55 (2016)  
Target
Name:
Histone deacetylase 6
Synonyms:
Cereblon/Histone deacetylase 6 HDAC6 Histone deacetylase 6 (HDAC6) KIAA0901 | ORF Names:JM21
Type:
Chromatin regulator; hydrolase; repressor
Mol. Mass.:
131381.51
Organism:
Homo sapiens (Human)
Description:
Q9UBN7
Residue:
1215
  
Inhibitor
Name:
BDBM50148616
Synonyms:
CHEMBL3770606
Type:
Small organic molecule
Emp. Form.:
C10H7BrN2O3
Mol. Mass.:
283.078
SMILES:
ONC(=O)c1coc(n1)-c1ccccc1Br
: