Target
Alpha-galactosidase A
Ligand
BDBM50150471
Substrate
Meas. Tech.
ChEMBL_1558581 (CHEMBL3774070)
Ki
>2000000±n/a nM
Citation
 Thonhofer, MWeber, PSantana, AGFischer, RPabst, BMPaschke, ESchalli, MStütz, AETschernutter, MWindischhofer, WWithers, SG Synthesis of C-5a-chain extended derivatives of 4-epi-isofagomine: Powerfulß-galactosidase inhibitors and low concentration activators of GM1-gangliosidosis-related human lysosomalß-galactosidase. Bioorg Med Chem Lett 26:1438-42 (2016)  
Target
Name:
Alpha-galactosidase A
Synonyms:
AGAL_HUMAN Alpha-D-galactoside galactohydrolase Alpha-glucosidase A (α-Gal A) INN=Agalsidase | Melibiase
Type:
Protein
Mol. Mass.:
48760.21
Organism:
Homo sapiens (Human)
Description:
Residue:
429
  
Inhibitor
Name:
BDBM50150471
Synonyms:
CHEMBL3770764
Type:
Small organic molecule
Emp. Form.:
C8H17NO4
Mol. Mass.:
191.2249
SMILES:
OCC[C@H]1NC[C@@H](O)[C@@H](O)[C@H]1CO
: