Target
Telomerase reverse transcriptase
Ligand
BDBM50152101
Substrate
Meas. Tech.
ChEMBL_1565122 (CHEMBL3782444)
IC50
>60000±n/a nM
Citation
 Xiao, XNi, YJia, YMZheng, MXu, HFXu, JLiao, C Identification of human telomerase inhibitors having the core of N-acyl-4,5-dihydropyrazole with anticancer effects. Bioorg Med Chem Lett 26:1508-11 (2016)  
Target
Name:
Telomerase reverse transcriptase
Synonyms:
EST2 TERT TRT
Type:
PROTEIN
Mol. Mass.:
127099.03
Organism:
Homo sapiens (Human)
Description:
ChEMBL_1447029
Residue:
1132
  
Inhibitor
Name:
BDBM50152101
Synonyms:
CHEMBL3780707
Type:
Small organic molecule
Emp. Form.:
C17H14BrF3N2O3S
Mol. Mass.:
463.269
SMILES:
CC1=NN(C(C1)c1cc(Br)ccc1O)S(=O)(=O)c1ccc(cc1)C(F)(F)F
: