Target
Peroxisome proliferator-activated receptor gamma
Ligand
BDBM50189691
Substrate
Meas. Tech.
ChEMBL_1589792 (CHEMBL3830344)
EC50
1235±n/a nM
Citation
 Shi, YLi, JKennedy, LJTao, SHernández, ASLai, ZChen, SWong, HZhu, JTrehan, ALim, NKZhang, HChen, BCLocke, KTO'Malley, KMZhang, LSrivastava, RAMiao, BMeyers, DSMonshizadegan, HSearch, DGrimm, DZhang, RHarrity, TKunselman, LKCap, MMuckelbauer, JChang, CKrystek, SRLi, YXHosagrahara, VZhang, LKadiyala, PXu, CBlanar, MAZahler, RMukherjee, RCheng, PTTino, JA Discovery and Preclinical Evaluation of BMS-711939, an Oxybenzylglycine Based PPARa Selective Agonist. ACS Med Chem Lett 7:590-4 (2016)  
Target
Name:
Peroxisome proliferator-activated receptor gamma
Synonyms:
NR1C3 PPAR-gamma PPARG_HUMAN Peroxisome proliferator-activated receptor gamma (PPAR gamma) Peroxisome proliferator-activated receptor gamma (PPARγ) peroxisome proliferator-activated receptor gamma isoform 2
Type:
Nuclear Receptor
Mol. Mass.:
57613.46
Organism:
Homo sapiens (Human)
Description:
P37231
Residue:
505
  
Inhibitor
Name:
BDBM50189691
Synonyms:
CHEMBL3828133
Type:
Small organic molecule
Emp. Form.:
C25H26ClFN2O6
Mol. Mass.:
504.935
SMILES:
CCCCOC(=O)N(CC(O)=O)Cc1cc(OCc2nc(oc2C)-c2ccc(Cl)cc2)ccc1F
: