Target
Dipeptidyl peptidase 1
Ligand
BDBM50195242
Substrate
Meas. Tech.
ChEMBL_1617559 (CHEMBL3859628)
IC50
16±n/a nM
Citation
 Connolly, SLönn, HKäck, HVan de Poël, ADahl, GDoyle, KGardiner, PRoot, JWikell, CJohannesson, PStenvall, KSwallow, S Discovery of Second Generation Reversible Covalent DPP1 Inhibitors Leading to an Oxazepane Amidoacetonitrile Based Clinical Candidate (AZD7986). J Med Chem 59:9457-9472 (2016)  
Target
Name:
Dipeptidyl peptidase 1
Synonyms:
CATC_HUMAN CTSC Cathepsin J Dipeptidyl peptidase 1 (DPPI) Dipeptidyl peptidase I (DPPI)
Type:
Enzyme
Mol. Mass.:
51857.28
Organism:
Homo sapiens (Human)
Description:
P53634
Residue:
463
  
Inhibitor
Name:
BDBM50195242
Synonyms:
CHEMBL3917575 US10669245, Example 14 US11655221, Example 14 US20230278969, Example 14
Type:
Small organic molecule
Emp. Form.:
C24H24F2N4O3
Mol. Mass.:
454.4692
SMILES:
CN1C(=O)C(F)(F)c2ccc(cc12)-c1ccc(C[C@H](NC(=O)[C@@H]2CNCCCO2)C#N)cc1
: