Target
Acetylcholinesterase
Ligand
BDBM50206890
Substrate
Meas. Tech.
ChEMBL_1629468 (CHEMBL3872094)
IC50
980±n/a nM
Citation
 Basiri, AXiao, MMcCarthy, ADutta, DByrareddy, SNConda-Sheridan, M Design and synthesis of new piperidone grafted acetylcholinesterase inhibitors. Bioorg Med Chem Lett 27:228-231 (2017)  
Target
Name:
Acetylcholinesterase
Synonyms:
ACES_HUMAN Acetylcholinesterase (AChE) | Acetylcholinesterase (human AChE)
Type:
Enzyme
Mol. Mass.:
67792.70
Organism:
Homo sapiens (Human)
Description:
P22303
Residue:
614
  
Inhibitor
Name:
BDBM50206890
Synonyms:
CHEMBL3910830
Type:
Small organic molecule
Emp. Form.:
C34H29N3S
Mol. Mass.:
511.679
SMILES:
Cc1ccc(\C=C2\CNCC3=C2N=C2SC=C(N2C3c2ccc(C)cc2)c2ccc3ccccc3c2)cc1
: