Target
Neurotensin receptor type 1/2
Ligand
BDBM50217110
Substrate
Meas. Tech.
ChEBML_144288
Ki
>2000±n/a nM
Citation
 Lundquist, JTDix, TA Preparation and receptor binding affinities of cyclic C-terminal neurotensin (8-13) and (9-13) analogues. Bioorg Med Chem Lett 9:2579-82 (1999)  
Target
Name:
Neurotensin receptor type 1/2
Synonyms:
Neurotensin receptor
Type:
Mol. Mass.:
Description:
ASSAY_ID of ChEMBL is 144284
Components:
This complex has 2 components.
Component 1
Name:
Neurotensin receptor type 2
Synonyms:
Levocabastine-sensitive neurotensin receptor NTR2 NTR2_HUMAN Neurotensin receptor Neurotensin receptor type 2
Type:
PROTEIN
Mol. Mass.:
45404.76
Organism:
Homo sapiens (Human)
Description:
ChEMBL_1281495
Residue:
410
  
Component 2
Name:
Neurotensin receptor type 1
Synonyms:
Dopamine receptor D2L/neurotensin receptor NTS1 NTRR Neurotensin receptor 1 | neurotensin receptor type 1
Type:
PROTEIN
Mol. Mass.:
46278.89
Organism:
Homo sapiens (Human)
Description:
ChEMBL_1453811
Residue:
418
  
Inhibitor
Name:
BDBM50217110
Synonyms:
CHEMBL1790701
Type:
Small organic molecule
Emp. Form.:
C32H48N4O7
Mol. Mass.:
600.7461
SMILES:
[H][C@@]12CCCN1C(=O)CCCCCOc1ccc(C[C@H](NC2=O)C(=O)N[C@H]([C@H](C)CC)C(=O)N[C@@H](CC(C)C)C(O)=O)cc1
: