Target
Alpha-2A/Alpha-2B/Alpha-2C adrenergic receptor
Ligand
BDBM50230389
Substrate
Meas. Tech.
ChEMBL_33316 (CHEMBL645612)
IC50
0.003400±n/a nM
Citation
 Amemiya, YHong, SSVenkataraman, BVPatil, PNShams, GRomstedt, KFeller, DRHsu, FLMiller, DD Synthesis and alpha-adrenergic activities of 2- and 4-substituted imidazoline and imidazole analogues. J Med Chem 35:750-5 (1992)  
Target
Name:
Alpha-2A/Alpha-2B/Alpha-2C adrenergic receptor
Synonyms:
Adrenergic Receptors (alpha 2) | Adrenergic receptor alpha-2
Type:
Mol. Mass.:
Description:
ASSAY_ID of ChEMBL is 305672
Components:
This complex has 3 components.
Component 1
Name:
Alpha-2B adrenergic receptor
Synonyms:
ADA2B_HUMAN ADRA2L1 Adrenergic alpha2B Adrenergic receptor alpha Alpha-2 adrenergic receptor subtype C2 Alpha-2B adrenoreceptor | Alpha-2BAR
Type:
Enzyme
Mol. Mass.:
49964.20
Organism:
Homo sapiens (Human)
Description:
P18089
Residue:
450
  
Component 2
Name:
Alpha-2A adrenergic receptor
Synonyms:
ADA2A_HUMAN ADRA2R Adrenergic alpha2A Alpha-2 adrenergic receptor subtype C10 Alpha-2A adrenoreceptor alpha-2A adrenergic receptor [Homo sapiens]
Type:
Enzyme
Mol. Mass.:
48979.91
Organism:
Homo sapiens (Human)
Description:
P08913
Residue:
450
  
Component 3
Name:
Alpha-2C adrenergic receptor
Synonyms:
ADA2C_HUMAN ADRA2L2 Adrenergic alpha2C Adrenergic receptor alpha Alpha-2 adrenergic receptor subtype C4 Alpha-2C adrenoreceptor | adrenergic, alpha-2C-, receptor [Homo sapiens]
Type:
Enzyme
Mol. Mass.:
49552.32
Organism:
Homo sapiens (Human)
Description:
P18825
Residue:
462
  
Inhibitor
Name:
BDBM50230389
Synonyms:
CHEMBL541105
Type:
Small organic molecule
Emp. Form.:
C15H15ClN2
Mol. Mass.:
258.746
SMILES:
Cl.CC(c1c[nH]cn1)c1cccc2ccccc12
: