Target
Cholinesterase
Ligand
BDBM50222222
Substrate
Meas. Tech.
ChEMBL_1648347 (CHEMBL3997403)
Ki
51±n/a nM
Citation
 Park, BNam, JHKim, JHKim, HJOnnis, VBalboni, GLee, KTPark, JHCatto, MCarotti, ALee, JY 3,4-Dihydroquinazoline derivatives inhibit the activities of cholinesterase enzymes. Bioorg Med Chem Lett 27:1179-1185 (2017)  
Target
Name:
Cholinesterase
Synonyms:
BCHE CHLE_HORSE | Cholinesterase
Type:
Enzyme
Mol. Mass.:
65643.35
Organism:
Equus caballus (Horse)
Description:
P81908
Residue:
574
  
Inhibitor
Name:
BDBM50222222
Synonyms:
CHEMBL394956 N-benzyl-2-(3-(biphenyl-4-yl)-2-((5-(dimethylamino)pentyl)(methyl)amino)-3,4-dihydroquinazolin-4-yl)acetamide | N-benzyl-2-{3-biphenyl-4-yl-2-[(5-dimethylamino-pentyl)-methyl-amino]-3,4-dihydro-quinazolin-4-yl}-acetamide
Type:
Small organic molecule
Emp. Form.:
C37H43N5O
Mol. Mass.:
573.7702
SMILES:
CN(C)CCCCCN(C)C1=Nc2ccccc2C(CC(=O)NCc2ccccc2)N1c1ccc(cc1)-c1ccccc1
: