Target
Mitogen-activated protein kinase 14
Ligand
BDBM50234895
Substrate
Meas. Tech.
ChEMBL_1654062 (CHEMBL4003428)
IC50
100±n/a nM
Citation
 Muth, FEl-Gokha, AAnsideri, FEitel, MDöring, ESievers-Engler, ALange, ABoeckler, FMLämmerhofer, MKoch, PLaufer, SA Tri- and Tetrasubstituted Pyridinylimidazoles as Covalent Inhibitors of c-Jun N-Terminal Kinase 3. J Med Chem 60:594-607 (2017)  
Target
Name:
Mitogen-activated protein kinase 14
Synonyms:
CSAID-binding protein CSBP1 CSPB1 MAP kinase 14 MAP kinase p38 alpha MAPK14 MK14_HUMAN Mitogen-activated protein kinase p38 alpha Stress-activated protein kinase 2a | p38 MAP kinase alpha/beta
Type:
Serine/threonine-protein kinase
Mol. Mass.:
41286.76
Organism:
Homo sapiens (Human)
Description:
Q16539
Residue:
360
  
Inhibitor
Name:
BDBM50234895
Synonyms:
CHEMBL4071770
Type:
Small organic molecule
Emp. Form.:
C33H29FN6O2S
Mol. Mass.:
592.686
SMILES:
CSc1nc(c(-c2ccnc(Nc3cccc(NC(=O)c4cccc(NC(=O)C=C)c4C)c3)c2)n1C)-c1ccc(F)cc1
: