Target
Tyrosine-protein kinase SYK
Ligand
BDBM50235825
Substrate
Meas. Tech.
ChEMBL_1658036 (CHEMBL4007648)
EC50
30±n/a nM
Citation
 Hoemann, MWilson, NArgiriadi, MBanach, DBurchat, ACalderwood, DClapham, BCox, PDuignan, DBKonopacki, DSomal, GVasudevan, A Synthesis and optimization of furano[3,2-d]pyrimidines as selective spleen tyrosine kinase (Syk) inhibitors. Bioorg Med Chem Lett 26:5562-5567 (2016)  
Target
Name:
Tyrosine-protein kinase SYK
Synonyms:
KSYK_HUMAN Spleen Tyrosine Kinase Tyrosine-protein kinase SYK (Syk)
Type:
Enzyme
Mol. Mass.:
72079.99
Organism:
Homo sapiens (Human)
Description:
P43405
Residue:
635
  
Inhibitor
Name:
BDBM50235825
Synonyms:
CHEMBL4065615
Type:
Small organic molecule
Emp. Form.:
C20H23N5O3
Mol. Mass.:
381.4283
SMILES:
CCCNc1nc(Nc2ccc3c(NC(=O)COC3(C)C)c2)nc2ccoc12
: