Target
Adenosine receptor A3
Ligand
BDBM82558
Substrate
Ki
15±n/a nM
Comments
PDSP_946
Citation
 Linden, JThai, TFigler, HJin, XRobeva, AS Characterization of human A(2B) adenosine receptors: radioligand binding, western blotting, and coupling to G(q) in human embryonic kidney 293 cells and HMC-1 mast cells. Mol Pharmacol 56:705-13 (1999) Target
Name:
Adenosine receptor A3
Synonyms:
A3 adenosine receptor (hA3) ADORA3 | Adenosine A3 receptor (A3AR)
Type:
G Protein-Coupled Receptor (GPCR)
Mol. Mass.:
36197.32
Organism:
Homo sapiens (Human)
Description:
P0DMS8
Residue:
318
  
Inhibitor
Name:
BDBM82558
Synonyms:
CAS_163889 I-ABOPX | NSC_163889
Type:
Small organic molecule
Emp. Form.:
C23H22IN5O5
Mol. Mass.:
575.3558
SMILES:
CCCn1c(=O)n(Cc2ccc(N)c(I)c2)c2nc([nH]c2c1=O)-c1ccc(OCC(O)=O)cc1
: