Target
Translocator protein
Ligand
BDBM98173
Substrate
Meas. Tech.
In Vitro Binding Assay
Ki
0.97±0.0 nM
Citation
 Kassiou, MJames, MLLuus, CA Translocator protein ligands US Patent  US8492379 Publication Date 7/23/2013 
Target
Name:
Translocator protein
Synonyms:
BZRP Mitochondrial benzodiazepine receptor PKBS Peripheral-type benzodiazepine receptor TSPO_HUMAN
Type:
Enzyme
Mol. Mass.:
18834.74
Organism:
Homo sapiens (Human)
Description:
P30536
Residue:
169
  
Inhibitor
Name:
BDBM98173
Synonyms:
US8492379, 29
Type:
Small organic molecule
Emp. Form.:
C20H23BrN4O
Mol. Mass.:
415.327
SMILES:
CCN(CC)C(=O)Cc1c(nc2c(C)cc(C)nn12)-c1ccc(Br)cc1
: