Target
Chymase
Ligand
BDBM100314
Substrate
Meas. Tech.
In Vitro Assay
pH
8±0
Temperature
301.15±0 K
IC50
11±0.0 nM
Citation
 Guo, XMan, CCTakahashi, H Azaquinazolinediones chymase inhibitors US Patent  US8501749 Publication Date 8/6/2013 
Target
Name:
Chymase
Synonyms:
Alpha-chymase CMA1_HUMAN CYM Mast cell protease I
Type:
Enzyme
Mol. Mass.:
27340.12
Organism:
Homo sapiens (Human)
Description:
Residue:
247
  
Inhibitor
Name:
BDBM100314
Synonyms:
US8501749, 14
Type:
Small organic molecule
Emp. Form.:
C25H28N4O4
Mol. Mass.:
448.5142
SMILES:
CCCCC(Cn1c(=O)n(Cc2cn(C)c3cccc(C)c23)c2ccncc2c1=O)C(O)=O
: