Target
Adhesin Ata autotransporter
Ligand
BDBM281005
Substrate
Meas. Tech.
Antimicrobial Susceptibility Testing Assay
IC50
<390±n/a nM
Citation
 Alanine, ABeignet, JBleicher, KFasching, BHilpert, HHu, TMacDonald, DJackson, SKolczewski, SKroll, CSchaeublin, AShen, HStoll, TThomas, HWahhab, AZampaloni, C Peptide macrocycles against acinetobacter baumannii US Patent  US10030047 Publication Date 7/24/2018 
Target
Name:
Adhesin Ata autotransporter
Synonyms:
ATA_ACIBT ata | ata:
Type:
Enzyme Catalytic Domain
Mol. Mass.:
189662.81
Organism:
Acinetobacter baumannii (strain ATCC 17978 / CIP 53.77 / LMG 1025 / NCDC KC755 / 5377)
Description:
A3M3H0
Residue:
1873
  
Inhibitor
Name:
BDBM281005
Synonyms:
(8S,11S,14S)-8-((1H-Indol-3-yl)methyl)-11-(4-aminobutyl)-14-(3-aminopropyl)-3-chloro-9-methyl-5,6,8,9,11,12,15,16-octahydrobenzo[b]pyrido[4,3-p][1,5,8,11,14]thiatetraazacycloheptadecine-7,10,13(14H)-trione | US10030047, Example 153
Type:
Small organic molecule
Emp. Form.:
C36H45ClN8O3S
Mol. Mass.:
705.312
SMILES:
CN1[C@@H](Cc2c[nH]c3ccccc23)C(=O)NCc2cc(Cl)ncc2Sc2ccccc2CN[C@@H](CCCN)C(=O)N[C@@H](CCCCN)C1=O
: