Target
Cannabinoid receptor 1
Ligand
BDBM115133
Substrate
Meas. Tech.
Biological Assay
EC50
2.00±n/a nM
Citation
 Macielag, MJZhang, RParker, MHDeCorte, BLGreco, MN Indazole derivatives useful as CB-1 inverse agonists US Patent  US9682940 Publication Date 6/20/2017 
Target
Name:
Cannabinoid receptor 1
Synonyms:
CANN6 CB-R CNR CNR1_HUMAN Cannabinoid receptor Cannabinoid receptor 1 (brain)
Type:
G Protein-Coupled Receptor (GPCR)
Mol. Mass.:
52868.96
Organism:
Homo sapiens (Human)
Description:
P21554
Residue:
472
  
Inhibitor
Name:
BDBM115133
Synonyms:
US9682940, 67
Type:
Small organic molecule
Emp. Form.:
C28H28F3N3O4S
Mol. Mass.:
559.6
SMILES:
COc1ccc(cc1)C(c1ccc(OC)cc1)c1ccc2[nH]nc(C3CCN(CC3)S(=O)(=O)C(F)(F)F)c2c1
: