Target
Transient receptor potential cation channel subfamily V member 1
Ligand
BDBM143823
Substrate
Meas. Tech.
Activation Assay
IC50
21±n/a nM
Citation
 Dart, MJKym, PRVoight, EAShrestha, ADaanen, JFJinkerson, TKKeddy, RGPeddi, SGomtsyan, AKort, MEGfesser, GAWoller, KRNelson, DW TRPV1 antagonists US Patent  US8969325 Publication Date 3/3/2015 
Target
Name:
Transient receptor potential cation channel subfamily V member 1
Synonyms:
Capsaicin receptor Osm-9-like TRP channel 1 TRPV1_HUMAN Transient receptor potential cation channel subfamily V member 1 (TRPV1) Transient receptor potential cation channel subfamily V member 1(TRPV1) Vanilloid VR1 Vanilloid receptor 1 Vanilloid receptor 1 (VRI/TRPV1)
Type:
Protein
Mol. Mass.:
94960.75
Organism:
Homo sapiens (Human)
Description:
Q8NER1
Residue:
839
  
Inhibitor
Name:
BDBM143823
Synonyms:
US8969325, 24
Type:
Small organic molecule
Emp. Form.:
C22H22FN3O3
Mol. Mass.:
395.4268
SMILES:
Cn1c2cccc(NC(=O)N[C@@H]3CC(C)(C)Oc4ccc(F)cc34)c2ccc1=O
: