Target
Apoptosis regulator Bcl-2
Ligand
BDBM144851
Substrate
Meas. Tech.
Time Resolved-Fluorescence Resonance Energy Transfer (TR-FRET) Assay
Temperature
298.15±n/a K
Ki
7.173±n/a nM
Comments
extracted
Citation
 Ding, HDoherty, GAElmore, SWHexamer, LKunzer, ARPark, CSong, XSouers, AJSullivan, GMTao, ZWang, LWendt, MDCzabotar, PELessene, GLColman, PM Apoptosis-inducing agents for the treatment of cancer and immune and autoimmune diseases US Patent  US8952157 Publication Date 2/10/2015 
Target
Name:
Apoptosis regulator Bcl-2
Synonyms:
Apoptosis regulator Bcl-2 Protein BCL-2 BCL2_HUMAN | Bcl-2 Protein
Type:
Homodimer or heterodimer
Mol. Mass.:
26269.11
Organism:
Homo sapiens (Human)
Description:
P10415
Residue:
239
  
Inhibitor
Name:
BDBM144851
Synonyms:
US8952157, 33 | US9303025, 33
Type:
Small organic molecule
Emp. Form.:
C48H50ClN7O7S2
Mol. Mass.:
936.536
SMILES:
Cc1nc(C)c(s1)-c1cccc(Oc2cc(ccc2C(=O)NS(=O)(=O)c2ccc(NCCCN3CCOCC3)c(c2)[N+]([O-])=O)N2CCN(Cc3ccccc3-c3ccc(Cl)cc3)CC2)c1
: