Target
Serine/threonine-protein kinase TBK1
Ligand
BDBM5446
Substrate
Meas. Tech.
KinEASE-STK Assay
IC50
2.20e+3± 4.8e+2 nM
Citation
 Richters, ABasu, DEngel, JErcanoglu, MSBalke-Want, HTesch, RThomas, RKRauh, D Identification and further development of potent TBK1 inhibitors. ACS Chem Biol 10:289-98 (2015)  
Target
Name:
Serine/threonine-protein kinase TBK1
Synonyms:
NAK Protein cereblon/Serine/threonine-protein kinase TBK1 TANK-binding kinase 1 (TBK-1) TBK1 | TBK1_HUMAN
Type:
protein
Mol. Mass.:
83645.20
Organism:
Homo sapiens (Human)
Description:
Q9UHD2
Residue:
729
  
Inhibitor
Name:
BDBM5446
Synonyms:
CHEMBL553 Erlotinib N-(3-Ethynylphenyl)-6,7-bis(2-methoxyethoxy)-4-quinazolinamine Monohydrochloride OSI-774 US10189853, erlotinib US11524945, Compound Erlotinib US9730934, Erlotinib cid_176870
Type:
Small organic molecule
Emp. Form.:
C22H23N3O4
Mol. Mass.:
393.4357
SMILES:
COCCOc1cc2ncnc(Nc3cccc(c3)C#C)c2cc1OCCOC
: