Target
Solute carrier family 22 member 12
Ligand
BDBM165900
Substrate
Meas. Tech.
Inhibition Assay
pH
7.4±n/a
IC50
3±n/a nM
Comments
extracted
Citation
 Storer, RISwain, NAOwen, RM Chemical compounds US Patent  US9067922 Publication Date 6/30/2015 
Target
Name:
Solute carrier family 22 member 12
Synonyms:
OATL4 RST S22AC_HUMAN Solute carrier family 22 member 12 URAT1 Urate anion exchanger 1 (URAT1) | Uric Acid Transporter 1 (URAT1)
Type:
Enzyme
Mol. Mass.:
59638.65
Organism:
Homo sapiens (Human)
Description:
Q96S37
Residue:
553
  
Inhibitor
Name:
BDBM165900
Synonyms:
US9067922, 241
Type:
Small organic molecule
Emp. Form.:
C19H9Cl2FN4O3S
Mol. Mass.:
463.269
SMILES:
Fc1ccc(NS(=O)(=O)c2ccc(Oc3cc(Cl)c(C#N)c(Cl)c3)c(c2)C#N)nc1
: