Target
P2X purinoceptor 7
Ligand
BDBM173625
Substrate
Meas. Tech.
Binding Assay
pH
7.4±n/a
Temperature
298.15±n/a K
IC50
620±n/a nM
Comments
extracted
Citation
 Kilburn, JPRasmussen, LKJessing, MEldemenky, EMChen, BJiang, YHopper, AT Benzamides US Patent  US9102591 Publication Date 8/11/2015 
Target
Name:
P2X purinoceptor 7
Synonyms:
ATP receptor P2RX7_HUMAN P2X purinoceptor 7 (P2X7) P2Z receptor | Purinergic receptor
Type:
Protein
Mol. Mass.:
68602.85
Organism:
Homo sapiens (Human)
Description:
Q99572
Residue:
595
  
Inhibitor
Name:
BDBM173625
Synonyms:
US9102591, N-[4-(4-Chloro-phenyl)-tetrahydro-pyran-4-ylmethyl]-2-methoxy-benzamide | US9649308, N-[4-(4-Chloro-phenyl)-tetrahydro-pyran-4-ylmethyl]-2-methoxy-benzamide
Type:
Small organic molecule
Emp. Form.:
C20H22ClNO3
Mol. Mass.:
359.847
SMILES:
COc1ccccc1C(=O)NCC1(CCOCC1)c1ccc(Cl)cc1
: