Target
P2X purinoceptor 7
Ligand
BDBM173681
Substrate
Meas. Tech.
Binding Assay
pH
7.4±n/a
Temperature
298.15±n/a K
IC50
0.71±n/a nM
Comments
extracted
Citation
 Kilburn, JPRasmussen, LKJessing, MEldemenky, EMChen, BJiang, YHopper, AT Benzamides US Patent  US9102591 Publication Date 8/11/2015 
Target
Name:
P2X purinoceptor 7
Synonyms:
ATP receptor P2RX7_HUMAN P2X purinoceptor 7 (P2X7) P2Z receptor | Purinergic receptor
Type:
Protein
Mol. Mass.:
68602.85
Organism:
Homo sapiens (Human)
Description:
Q99572
Residue:
595
  
Inhibitor
Name:
BDBM173681
Synonyms:
US9102591, 3-bromo-N-((4,4-difluoro-1-(6-(trifluoromethyl)pyridin-3-yl)cyclohexyl)methyl)-2-methylbenzamide | US9649308, 3-bromo-N-((4,4-difluoro-1-(6-(trifluoromethyl)pyridin-3-yl)cyclohexyl)methyl)-2-methylbenzamide
Type:
Small organic molecule
Emp. Form.:
C21H20BrF5N2O
Mol. Mass.:
491.292
SMILES:
Cc1c(Br)cccc1C(=O)NCC1(CCC(F)(F)CC1)c1ccc(nc1)C(F)(F)F
: