Target
Lysosomal alpha-glucosidase
Ligand
BDBM190539
Substrate
Meas. Tech.
Enzyme Activity Assay
pH
4±n/a
EC50
6600±900 nM
Comments
extracted
Citation
 Mugrage, BLee, GZhu, XBoyd, RSheth, K Method for the treatment of pompe disease using 1-deoxynojirimycin and derivatives US Patent  US9181184 Publication Date 11/10/2015 
Target
Name:
Lysosomal alpha-glucosidase
Synonyms:
α-Glucosidase Gaa Lysosomal alpha-glucosidase | alpha-glucosidase (Gaa)
Type:
Enzyme
Mol. Mass.:
106235.32
Organism:
Mus musculus (Mouse)
Description:
P70699
Residue:
953
  
Inhibitor
Name:
BDBM190539
Synonyms:
US9181184, 26
Type:
Small organic molecule
Emp. Form.:
C18H29NO5
Mol. Mass.:
339.4266
SMILES:
CCCCCOc1ccc(CN2C[C@H](O)[C@@H](O)[C@H](O)[C@H]2CO)cc1
: