Target
Poly [ADP-ribose] polymerase 2
Ligand
BDBM191216
Substrate
Meas. Tech.
Biochemical Assay
Temperature
298.15±n/a K
IC50
1970±260 nM
Comments
extracted
Citation
 Cheung, AKChin, DNFan, JMiller-Moslin, KMShultz, MDSmith, TDTomlinson, RCToure, BVisser, MSChen, Z 2-piperidin-1-yl-acetamide compounds for use as tankyrase inhibitors US Patent  US9181266 Publication Date 11/10/2015 
Target
Name:
Poly [ADP-ribose] polymerase 2
Synonyms:
(ARTD2 or PARP2) ADPRTL2 PARP2_HUMAN Poly [ADP-ribose] polymerase 2 (PARP2)
Type:
Enzyme
Mol. Mass.:
66225.70
Organism:
Homo sapiens (Human)
Description:
Q9UGN5
Residue:
583
  
Inhibitor
Name:
BDBM191216
Synonyms:
US9181266, 85
Type:
Small organic molecule
Emp. Form.:
C26H32N4O5
Mol. Mass.:
480.5561
SMILES:
O=C(CN1CCC(CC1)C(=O)c1ccc(OCC2CC2)cc1)NCc1nc2CCOCc2c(=O)[nH]1
: