Target
Thyroid hormone receptor beta
Ligand
BDBM86689
Substrate
Ki
>10000±n/a nM
Citation
 Jacobson, PBvon Geldern, TWOhman, LOsterland, MWang, JZinker, BWilcox, DNguyen, PTMika, AFung, SFey, TGoos-Nilsson, AGrynfarb, MBarkhem, TMarsh, KBeno, DWNga-Nguyen, BKym, PRLink, JTTu, NEdgerton, DSCherrington, AEfendic, SLane, BCOpgenorth, TJ Hepatic glucocorticoid receptor antagonism is sufficient to reduce elevated hepatic glucose output and improve glucose control in animal models of type 2 diabetes. J Pharmacol Exp Ther 314:191-200 (2005)  
Target
Name:
Thyroid hormone receptor beta
Synonyms:
Erba2 THB_RAT Thyroid Hormone Receptor (TR-beta) Thyroid hormone receptor beta-1 | thyroid beta
Type:
Enzyme Catalytic Domain
Mol. Mass.:
52661.52
Organism:
RAT
Description:
thyroid beta 0 RAT::P18113
Residue:
461
  
Inhibitor
Name:
BDBM86689
Synonyms:
CAS_84371-65-3 RU-486
Type:
Small organic molecule
Emp. Form.:
C29H35NO2
Mol. Mass.:
429.5937
SMILES:
CC#CC1(O)CCC2C3CCC4=CC(=O)CCC4=C3C(CC12C)c1ccc(cc1)N(C)C
: