Target
Mitogen-activated protein kinase 1/3
Ligand
BDBM237222
Substrate
Meas. Tech.
Cell-Based Enzyme Inhibition Assay (ELISA)
IC50
3.21e+3±n/a nM
Citation
 Li, QSLv, PCLi, HQLu, XLi, ZLRuan, BFZhu, HL Synthesis and biological evaluation of novel N, N'-disubstituted urea and thiourea derivatives as potential anti-melanoma agents. J Enzyme Inhib Med Chem 27:708-14 (2012)  
Target
Name:
Mitogen-activated protein kinase 1/3
Synonyms:
Mitogen-activated protein kinase; ERK1/ERK2 t-ERK1/2
Type:
Mol. Mass.:
Description:
ASSAY_ID of ChEMBL is 124147
Components:
This complex has 2 components.
Component 1
Name:
Mitogen-activated protein kinase 1
Synonyms:
ERK2 Extracellular signal-regulated kinase 2 Extracellular signal-regulated kinase 2 (ERK2) MAPK 2 MK01_HUMAN Mitogen-activated protein kinase 1 (ERK-2) Mitogen-activated protein kinase 2 PRKM2 | p42-MAPK
Type:
Ser/Thr Protein Kinase
Mol. Mass.:
41392.76
Organism:
Homo sapiens (Human)
Description:
P28482
Residue:
360
  
Component 2
Name:
Mitogen-activated protein kinase 3
Synonyms:
ERK1 Extracellular signal-regulated kinase 1 MAP kinase ERK1 MAPK3/MAPK7 Mitogen-activated protein kinase PRKM3
Type:
Protein
Mol. Mass.:
43136.58
Organism:
Homo sapiens (Human)
Description:
curated by PDB 4QTB
Residue:
379
  
Inhibitor
Name:
BDBM237222
Synonyms:
1-(4-Hydroxy-3-methoxybenzyl)-1-(4-methoxyphenyl)-3-phenylthiourea (3b)
Type:
Small organic molecule
Emp. Form.:
C22H22N2O3S
Mol. Mass.:
394.487
SMILES:
COc1ccc(cc1)N(Cc1ccc(O)c(OC)c1)C(=S)Nc1ccccc1
: