Target
Cannabinoid receptor 2
Ligand
BDBM240576
Substrate
Meas. Tech.
cAMP Assay
Temperature
310.15±n/a K
EC50
0.3±n/a nM
Comments
extracted
Citation
 Grether, UKimbara, ANettekoven, MRicklin, FRoever, SRogers-Evans, MRombach, DSchulz-Gasch, TWestphal, M Pyridine-2-amides useful as CB2 agonists US Patent  US9409866 Publication Date 8/9/2016 
Target
Name:
Cannabinoid receptor 2
Synonyms:
CANNABINOID CB2 CB2 CB2B CNR2_HUMAN Cannabinoid CB2 receptor Cannabinoid receptor 2 (CB2R) | hCB2
Type:
G Protein-Coupled Receptor (GPCR)
Mol. Mass.:
39690.94
Organism:
Homo sapiens (Human)
Description:
P34972
Residue:
360
  
Inhibitor
Name:
BDBM240576
Synonyms:
US9409866, 291 | US9409866, 292
Type:
Small organic molecule
Emp. Form.:
C17H22FN3O5S
Mol. Mass.:
399.437
SMILES:
CC(CF)Oc1cc(ncc1C1CC1)C(=O)NC1(CC(N)=O)CS(=O)(=O)C1
: