Target
P2X purinoceptor 7
Ligand
BDBM242069
Substrate
Meas. Tech.
Fluorescent Imaging Plate Reader (FLIPR) Assay
pH
7.4±n/a
Temperature
310.15±n/a K
IC50
0.65±n/a nM
Comments
extracted
Citation
 Kilburn, JPRasmussen, LKJessing, MEldemenky, EMChen, BJiang, Y Cyclic amines US Patent  US9415055 Publication Date 8/16/2016 
Target
Name:
P2X purinoceptor 7
Synonyms:
ATP receptor P2RX7_HUMAN P2X purinoceptor 7 (P2X7) P2Z receptor | Purinergic receptor
Type:
Protein
Mol. Mass.:
68602.85
Organism:
Homo sapiens (Human)
Description:
Q99572
Residue:
595
  
Inhibitor
Name:
BDBM242069
Synonyms:
US9415055, 2,3-dichloro-N-[2-(4,4-difluoro-1-piperidyl)-2-[2-(trifluoromethyl)pyrimidin-5-yl]ethyl]benzamide | US9593105, 70
Type:
Small organic molecule
Emp. Form.:
C19H17Cl2F5N4O
Mol. Mass.:
483.262
SMILES:
FC(F)(F)c1ncc(cn1)C(CNC(=O)c1cccc(Cl)c1Cl)N1CCC(F)(F)CC1
: