Target
P2X purinoceptor 7
Ligand
BDBM242080
Substrate
Meas. Tech.
Binding Assay
IC50
0.62±n/a nM
Citation
 Kilburn, JPRasmussen, LKJessing, MEldemenky, EMChen, BJiang, Y Cyclic amines US Patent  US9593105 Publication Date 3/14/2017 
Target
Name:
P2X purinoceptor 7
Synonyms:
ATP receptor P2RX7_HUMAN P2X purinoceptor 7 (P2X7) P2Z receptor | Purinergic receptor
Type:
Protein
Mol. Mass.:
68602.85
Organism:
Homo sapiens (Human)
Description:
Q99572
Residue:
595
  
Inhibitor
Name:
BDBM242080
Synonyms:
US9415055, (+)2-chloro-N-[2-(4,4-difluoro-1-piperidyl)-2-[6-(trifluoromethyl)-3-pyridyl]ethyl]-6-fluoro-benzamide | US9593105, 82
Type:
Small organic molecule
Emp. Form.:
C20H18ClF6N3O
Mol. Mass.:
465.82
SMILES:
Fc1cccc(Cl)c1C(=O)NCC(N1CCC(F)(F)CC1)c1ccc(nc1)C(F)(F)F
: