Target
Glycogen synthase kinase-3 beta
Ligand
BDBM7422
Substrate
GSK-3 Peptide Substrate
Meas. Tech.
Kinase Inhibition Assay
Temperature
303.15±n/a K
IC50
7±n/a nM
Comments
extracted
Citation
 Polychronopoulos, PMagiatis, PSkaltsounis, ALMyrianthopoulos, VMikros, ETarricone, AMusacchio, ARoe, SMPearl, LLeost, MGreengard, PMeijer, L Structural basis for the synthesis of indirubins as potent and selective inhibitors of glycogen synthase kinase-3 and cyclin-dependent kinases. J Med Chem 47:935-46 (2004)  
Target
Name:
Glycogen synthase kinase-3 beta
Synonyms:
GSK-3 alpha/beta | Glycogen Synthase Kinase-3, beta
Type:
Enzyme Mixture
Mol. Mass.:
48062.20
Organism:
Porcine
Description:
Purification of GSK-3 alpha and GSK-3 beta from Porcine Brain on Axin-Sepharose. Porcine brains were obtained from a local slaughter and directly homogenized and processed for affinity chromatography.
Residue:
433
  
Inhibitor
Name:
BDBM7422
Synonyms:
(2 Z,3 E)-6-Bromo-5-methylindirubin-3 -acetoxime [(3E)-2-[(3Z)-6-bromo-5-methyl-2-oxo-2,3-dihydro-1H-indol-3-ylidene]-2,3-dihydro-1H-indol-3-ylidene]amino acetate | indirubin deriv. 8f
Type:
Small organic molecule
Emp. Form.:
C19H14BrN3O3
Mol. Mass.:
412.237
SMILES:
CC(=O)ON=C1C(Nc2ccccc12)=C1C(=O)Nc2cc(Br)c(C)cc12
:
Substrate
Name:
GSK-3 Peptide Substrate
Synonyms:
GS-1 Peptide | Phospho-GS2 Substrate Peptide
Type:
Peptide
Mol. Mass.:
3045.17
Organism:
Description:
Residue:
27