BDBM101503 US8524710, 81::US8530652, 30::US8530652, 74
SMILES CC1(C)N(Cc2c(Nc3ccnc(n3)C(F)(F)F)[nH]nc12)C(=O)NC1C[C@@H]1c1ccccc1
InChI Key InChIKey=OLUNGVPQMWVIAU-AFYYWNPRSA-N
Data  1 KI  1 EC50
  Tab Delimited (TSV)   2D SDfile   Computed 3D by Vconf -m prep SDfile
Find this compound or compounds like it in BindingDB:
Activity Spreadsheet -- Enzyme Inhibition Constant Data from BindingDB
Found 1 hit for monomerid = 101503
TargetSerine/threonine-protein kinase PAK 4(Homo sapiens (Human))
Agouron Pharmaceuticals
US Patent
LigandPNGBDBM101503(US8524710, 81 | US8530652, 30 | US8530652, 74)
Affinity DataKi:  80nM EC50:  968nM. Assay description: The enzymatic activity of PAK4 KD was measured by its ability to catalyzed the transfer of a phosphate residue from a nucleoside triphosphate to an a...
In DepthDetails US Patent